graduate-n
type: LexicalEntry
canonical form: graduate
sense: 03456417-n
part of speech: noun

03456417-n
type: LexicalConcept
in scheme: en-word.net
definition: a measuring instrument for measuring fluid volume; a glass container (cup or cylinder or flask) whose sides are marked with or divided into amounts
ili: i54386
lexfile: noun.artifact
part of speech: noun
hypernym: 03739416-n