gondola car-n
type: LexicalEntry
canonical form: gondola car
sense: 03452537-n
part of speech: noun

gondola-n
type: LexicalEntry
canonical form: gondola
sense: 03452537-n
part of speech: noun

03452537-n
type: LexicalConcept
in scheme: en-word.net
definition: a low flat-bottomed freight car with fixed sides but no roof
ili: i54361
lexfile: noun.artifact
part of speech: noun
hypernym: 03398748-n