gem-n
type: LexicalEntry
canonical form: gem
sense: 03437882-n
part of speech: noun

treasure-n
type: LexicalEntry
canonical form: treasure
sense: 03437882-n
part of speech: noun

03437882-n
type: LexicalConcept
in scheme: en-word.net
definition: art highly prized for its beauty or perfection
ili: i54267
lexfile: noun.artifact
part of speech: noun
hypernym: 02746552-n