gazebo-n
type: LexicalEntry
canonical form: gazebo
sense: 03435328-n
part of speech: noun

summerhouse-n
type: LexicalEntry
canonical form: summerhouse
sense: 03435328-n
part of speech: noun

03435328-n
type: LexicalConcept
in scheme: en-word.net
definition: a small roofed building affording shade and rest
ili: i54255
lexfile: noun.artifact
part of speech: noun
hypernym: 02916498-n