garter-n
type: LexicalEntry
canonical form: garter
sense: 03426027-n
part of speech: noun

supporter-n
type: LexicalEntry
canonical form: supporter
sense: 03426027-n
part of speech: noun

03426027-n
type: LexicalConcept
in scheme: en-word.net
definition: a band (usually elastic) worn around the leg to hold up a stocking (or around the arm to hold up a sleeve)
ili: i54196
lexfile: noun.artifact
part of speech: noun
hypernym: 02787241-n