gallery-n
type: LexicalEntry
canonical form: gallery
sense: 03416454-n
part of speech: noun

03416454-n
type: LexicalConcept
in scheme: en-word.net
definition: narrow recessed balcony area along an upper floor on the interior of a building; usually marked by a colonnade
ili: i54144
lexfile: noun.artifact
part of speech: noun
hypernym: 02780739-n