gag-n
type: LexicalEntry
canonical form: gag
sense: 03415650-n
part of speech: noun

muzzle-n
type: LexicalEntry
canonical form: muzzle
sense: 03415650-n
part of speech: noun

03415650-n
type: LexicalConcept
in scheme: en-word.net
definition: restraint put into a person's mouth to prevent speaking or shouting
ili: i54139
lexfile: noun.artifact
part of speech: noun
hypernym: 04088956-n