furrow-n
type: LexicalEntry
canonical form: furrow
sense: 03411876-n
part of speech: noun

03411876-n
type: LexicalConcept
in scheme: en-word.net
definition: a long shallow trench in the ground (especially one made by a plow)
ili: i54115
lexfile: noun.artifact
part of speech: noun
hypernym: 04486124-n