furnishing-n
type: LexicalEntry
canonical form: furnishing
sense: 03410505-n
part of speech: noun

trappings-n
type: LexicalEntry
canonical form: trappings
sense: 03410505-n
part of speech: noun

03410505-n
type: LexicalConcept
in scheme: en-word.net
definition: (usually plural) accessory wearing apparel
ili: i54110
lexfile: noun.artifact
part of speech: noun
exemplifies: 06306016-n
hypernym: 02674410-n