frontal-n
type: LexicalEntry
canonical form: frontal
sense: 03403865-n
part of speech: noun

03403865-n
type: LexicalConcept
in scheme: en-word.net
definition: a drapery that covers the front of an altar
ili: i54072
lexfile: noun.artifact
part of speech: noun
hypernym: 03155743-n