fountain-n
type: LexicalEntry
canonical form: fountain
sense: 03392661-n
part of speech: noun

fount-n
type: LexicalEntry
canonical form: fount
sense: 03392661-n
part of speech: noun

03392661-n
type: LexicalConcept
in scheme: en-word.net
definition: a plumbing fixture that provides a flow of water
ili: i54007
lexfile: noun.artifact
part of speech: noun
hypernym: 03975617-n