football-n
type: LexicalEntry
canonical form: football
sense: 03383611-n
part of speech: noun

03383611-n
type: LexicalConcept
in scheme: en-word.net
definition: the inflated oblong ball used in playing American football
ili: i53951
lexfile: noun.artifact
part of speech: noun
hypernym: 02781674-n
mero part: 02851356-n