flush toilet-n
type: LexicalEntry
canonical form: flush toilet
sense: 03376721-n
part of speech: noun

lavatory-n
type: LexicalEntry
canonical form: lavatory
sense: 03376721-n
part of speech: noun

03376721-n
type: LexicalConcept
in scheme: en-word.net
definition: a toilet that is cleaned of waste by the flow of water through it
ili: i53907
lexfile: noun.artifact
part of speech: noun
hypernym: 04453655-n
mero part: 04026481-n