floor-n
type: LexicalEntry
canonical form: floor
sense: 03370438-n
part of speech: noun

flooring-n
type: LexicalEntry
canonical form: flooring
sense: 03370438-n
part of speech: noun

03370438-n
type: LexicalConcept
in scheme: en-word.net
definition: the inside lower horizontal surface (as of a room, hallway, tent, or other structure)
example: they needed rugs to cover the bare floors
example: we spread our sleeping bags on the dry floor of the tent
ili: i53865
lexfile: noun.artifact
part of speech: noun
hypernym: 03541528-n