flip-flop-n
type: LexicalEntry
canonical form: flip-flop
sense: 03368733-n
part of speech: noun

03368733-n
type: LexicalConcept
in scheme: en-word.net
definition: an electronic circuit that can assume either of two stable states
ili: i53855
lexfile: noun.artifact
part of speech: noun
hypernym: 03037347-n