film-n
type: LexicalEntry
canonical form: film
sense: 03344241-n
part of speech: noun

plastic film-n
type: LexicalEntry
canonical form: plastic film
sense: 03344241-n
part of speech: noun

03344241-n
type: LexicalConcept
in scheme: en-word.net
definition: a thin sheet of (usually plastic and usually transparent) material used to wrap or cover things
ili: i53701
lexfile: noun.artifact
part of speech: noun
hypernym: 04195686-n
hypernym: 04613084-n