faucet-n
type: LexicalEntry
canonical form: faucet
sense: 03330033-n
part of speech: noun

spigot-n
type: LexicalEntry
canonical form: spigot
sense: 03330033-n
part of speech: noun

03330033-n
type: LexicalConcept
in scheme: en-word.net
definition: a regulator for controlling the flow of a liquid from a reservoir
ili: i53616
lexfile: noun.artifact
part of speech: noun
hypernym: 04079305-n
mero part: 03491080-n