exchange-n
type: LexicalEntry
canonical form: exchange
sense: 03307432-n
part of speech: noun

03307432-n
type: LexicalConcept
in scheme: en-word.net
definition: a workplace for buying and selling; open only to members
ili: i53507
lexfile: noun.artifact
part of speech: noun
hypernym: 04609402-n
mero part: 03371147-n