equalizer-n
type: LexicalEntry
canonical form: equalizer
sense: 03298652-n
part of speech: noun

equaliser-n
type: LexicalEntry
canonical form: equaliser
sense: 03298652-n
part of speech: noun

03298652-n
type: LexicalConcept
in scheme: en-word.net
definition: electronic equipment that reduces frequency distortion
ili: i53455
lexfile: noun.artifact
part of speech: noun
hypernym: 03283159-n