engine-n
type: LexicalEntry
canonical form: engine
sense: 03292644-n
part of speech: noun

03292644-n
type: LexicalConcept
in scheme: en-word.net
definition: motor that converts thermal energy to mechanical work
ili: i53421
lexfile: noun.artifact
part of speech: noun
hypernym: 03795479-n
mero part: 02950279-n
mero part: 03436655-n