emplacement-n
type: LexicalEntry
canonical form: emplacement
sense: 03289031-n
part of speech: noun

03289031-n
type: LexicalConcept
in scheme: en-word.net
definition: military installation consisting of a prepared position for siting a weapon
ili: i53403
lexfile: noun.artifact
part of speech: noun
domain topic: 08215965-n
hypernym: 03768668-n