dock-n
type: LexicalEntry
canonical form: dock
sense: 03221894-n
part of speech: noun

03221894-n
type: LexicalConcept
in scheme: en-word.net
definition: an enclosure in a court of law where the defendant sits during the trial
ili: i53019
lexfile: noun.artifact
part of speech: noun
domain topic: 08458195-n
hypernym: 03290823-n