dinner table-n
type: LexicalEntry
canonical form: dinner table
sense: 03207038-n
part of speech: noun

03207038-n
type: LexicalConcept
in scheme: en-word.net
definition: the dining table where dinner is served and eaten
ili: i52933
lexfile: noun.artifact
part of speech: noun
hypernym: 03205892-n
mero part: 03657552-n