dial-n
type: LexicalEntry
canonical form: dial
sense: 03191502-n
part of speech: noun

telephone dial-n
type: LexicalEntry
canonical form: telephone dial
sense: 03191502-n
part of speech: noun

03191502-n
type: LexicalConcept
in scheme: en-word.net
definition: a disc on a telephone that is rotated a fixed distance for each number called
ili: i52840
lexfile: noun.artifact
part of speech: noun
hypernym: 04176498-n
mero part: 03346652-n