device-n
type: LexicalEntry
canonical form: device
sense: 03187746-n
part of speech: noun

03187746-n
type: LexicalConcept
in scheme: en-word.net
definition: an instrumentality invented for a particular purpose
example: the device is small enough to wear on your wrist
example: a device intended to conserve water
ili: i52831
lexfile: noun.artifact
part of speech: noun
hypernym: 03580409-n