creation-n
type: LexicalEntry
canonical form: creation
sense: 03133774-n
part of speech: noun

03133774-n
type: LexicalConcept
in scheme: en-word.net
definition: an artifact that has been brought into existence by someone
ili: i52486
lexfile: noun.artifact
part of speech: noun
hypernym: 00022119-n