crane-n
type: LexicalEntry
canonical form: crane
sense: 03131358-n
part of speech: noun

03131358-n
type: LexicalConcept
in scheme: en-word.net
definition: lifts and moves heavy objects; lifting tackle is suspended from a pivoted boom that rotates around a vertical axis
ili: i52471
lexfile: noun.artifact
part of speech: noun
hypernym: 03670001-n