costume-n
type: LexicalEntry
canonical form: costume
sense: 03118887-n
part of speech: noun

03118887-n
type: LexicalConcept
in scheme: en-word.net
definition: the prevalent fashion of dress (including accessories and hair style as well as garments)
ili: i52399
lexfile: noun.artifact
part of speech: noun
hypernym: 02759103-n