compass-n
type: LexicalEntry
canonical form: compass
sense: 03084637-n
part of speech: noun

03084637-n
type: LexicalConcept
in scheme: en-word.net
definition: drafting instrument used for drawing circles
ili: i52225
lexfile: noun.artifact
part of speech: noun
hypernym: 03235863-n