compass-n
type: LexicalEntry
canonical form: compass
sense: 03084501-n
part of speech: noun

03084501-n
type: LexicalConcept
in scheme: en-word.net
definition: navigational instrument for finding directions
ili: i52224
lexfile: noun.artifact
part of speech: noun
hypernym: 03818716-n