coil-n
type: LexicalEntry
canonical form: coil
sense: 03069712-n
part of speech: noun

03069712-n
type: LexicalConcept
in scheme: en-word.net
definition: reactor consisting of a spiral of insulated wire that introduces inductance into a circuit
ili: i52141
lexfile: noun.artifact
part of speech: noun
hypernym: 04064958-n