choir-n
type: LexicalEntry
canonical form: choir
sense: 03027747-n
part of speech: noun

03027747-n
type: LexicalConcept
in scheme: en-word.net
definition: the area occupied by singers; the part of the chancel between sanctuary and nave
ili: i51887
lexfile: noun.artifact
part of speech: noun
hypernym: 02738693-n