catalytic converter-n
type: LexicalEntry
canonical form: catalytic converter
sense: 02984780-n
part of speech: noun

02984780-n
type: LexicalConcept
in scheme: en-word.net
definition: a converter that uses a platinum-iridium catalyst to oxidize pollutants and carbon monoxide into carbon dioxide and water; an antipollution device on an automotive exhaust system
ili: i51630
lexfile: noun.artifact
part of speech: noun
hypernym: 03104596-n