castle-n
type: LexicalEntry
canonical form: castle
sense: 02983900-n
part of speech: noun

02983900-n
type: LexicalConcept
in scheme: en-word.net
definition: a large building formerly occupied by a ruler and fortified against attack
ili: i51625
lexfile: noun.artifact
part of speech: noun
hypernym: 03390403-n
mero part: 03615311-n
mero part: 04509242-n