cartridge-n
type: LexicalEntry
canonical form: cartridge
sense: 02975641-n
part of speech: noun

02975641-n
type: LexicalConcept
in scheme: en-word.net
definition: a module designed to be inserted into a larger piece of equipment
example: he loaded a cartridge of fresh tape into the tape deck
ili: i51574
lexfile: noun.artifact
part of speech: noun
hypernym: 03784133-n