cartridge-n
type: LexicalEntry
canonical form: cartridge
sense: 02975150-n
part of speech: noun

02975150-n
type: LexicalConcept
in scheme: en-word.net
definition: ammunition consisting of a cylindrical casing containing an explosive charge and a bullet; fired from a rifle or handgun
ili: i51572
lexfile: noun.artifact
part of speech: noun
hypernym: 02706134-n
mero part: 02919696-n