carrier-n
type: LexicalEntry
canonical form: carrier
sense: 02973559-n
part of speech: noun

02973559-n
type: LexicalConcept
in scheme: en-word.net
definition: a self-propelled wheeled vehicle designed specifically to carry something
example: refrigerated carriers have revolutionized the grocery business
ili: i51562
lexfile: noun.artifact
part of speech: noun
hypernym: 04177098-n