capsule-n
type: LexicalEntry
canonical form: capsule
sense: 02961022-n
part of speech: noun

02961022-n
type: LexicalConcept
in scheme: en-word.net
definition: a pill in the form of a small rounded gelatinous container with medicine inside
ili: i51491
lexfile: noun.artifact
part of speech: noun
hypernym: 03942844-n