canvas-n
type: LexicalEntry
canonical form: canvas
sense: 02957286-n
part of speech: noun

canvass-n
type: LexicalEntry
canonical form: canvass
sense: 02957286-n
part of speech: noun

02957286-n
type: LexicalConcept
in scheme: en-word.net
definition: the mat that forms the floor of the ring in which boxers or professional wrestlers compete
example: the boxer picked himself up off the canvas
ili: i51470
lexfile: noun.artifact
part of speech: noun
hypernym: 03733437-n