cabin-n
type: LexicalEntry
canonical form: cabin
sense: 02935611-n
part of speech: noun

02935611-n
type: LexicalConcept
in scheme: en-word.net
definition: small room on a ship or boat where people sleep
ili: i51336
lexfile: noun.artifact
part of speech: noun
hypernym: 03083745-n
mero part: 03870080-n