bustle-n
type: LexicalEntry
canonical form: bustle
sense: 02929975-n
part of speech: noun

02929975-n
type: LexicalConcept
in scheme: en-word.net
definition: a framework worn at the back below the waist for giving fullness to a woman's skirt
ili: i51300
lexfile: noun.artifact
part of speech: noun
hypernym: 03396616-n