brush-n
type: LexicalEntry
canonical form: brush
sense: 02911542-n
part of speech: noun

02911542-n
type: LexicalConcept
in scheme: en-word.net
definition: an implement that has hairs or bristles firmly set into a handle
ili: i51192
lexfile: noun.artifact
part of speech: noun
hypernym: 03569147-n
mero part: 02905839-n
mero part: 03491080-n