box-n
type: LexicalEntry
canonical form: box
sense: 02887252-n
part of speech: noun

02887252-n
type: LexicalConcept
in scheme: en-word.net
definition: separate partitioned area in a public place for a few people
example: the sentry stayed in his box to avoid the cold
ili: i51037
lexfile: noun.artifact
part of speech: noun
hypernym: 03083745-n