bow-n-1
type: LexicalEntry
canonical form: bow
sense: 02882960-n
part of speech: noun

02882960-n
type: LexicalConcept
in scheme: en-word.net
definition: a weapon for shooting arrows, composed of a curved piece of resilient wood with a taut cord to propel the arrow
ili: i51014
lexfile: noun.artifact
part of speech: noun
hypernym: 04572661-n
mero part: 02886342-n
mero part: 03674420-n