boot-n
type: LexicalEntry
canonical form: boot
sense: 02876762-n
part of speech: noun

02876762-n
type: LexicalConcept
in scheme: en-word.net
definition: protective casing for something that resembles a leg
ili: i50972
lexfile: noun.artifact
part of speech: noun
hypernym: 04197790-n