bomb calorimeter-n
type: LexicalEntry
canonical form: bomb calorimeter
sense: 02870932-n
part of speech: noun

bomb-n
type: LexicalEntry
canonical form: bomb
sense: 02870932-n
part of speech: noun

02870932-n
type: LexicalConcept
in scheme: en-word.net
definition: strong sealed vessel for measuring heat of combustion
ili: i50937
lexfile: noun.artifact
part of speech: noun
hypernym: 02944550-n