bolt-n
type: LexicalEntry
canonical form: bolt
sense: 02869271-n
part of speech: noun

deadbolt-n
type: LexicalEntry
canonical form: deadbolt
sense: 02869271-n
part of speech: noun

02869271-n
type: LexicalConcept
in scheme: en-word.net
definition: the part of a lock that is engaged or withdrawn with a key
ili: i50929
lexfile: noun.artifact
part of speech: noun
hypernym: 02791712-n