bolt-n
type: LexicalEntry
canonical form: bolt
sense: 02869005-n
part of speech: noun

02869005-n
type: LexicalConcept
in scheme: en-word.net
definition: a screw that screws into a nut to form a fastener
ili: i50928
lexfile: noun.artifact
part of speech: noun
hypernym: 04160812-n
mero part: 03046814-n
mero part: 03506432-n
mero part: 04191000-n