body stocking-n
type: LexicalEntry
canonical form: body stocking
sense: 02866354-n
part of speech: noun

02866354-n
type: LexicalConcept
in scheme: en-word.net
definition: a one-piece tight-fitting undergarment for women that covers the torso (and may have sleeves and legs)
ili: i50910
lexfile: noun.artifact
part of speech: noun
hypernym: 04515458-n