board-n
type: LexicalEntry
canonical form: board
sense: 02860303-n
part of speech: noun

gameboard-n
type: LexicalEntry
canonical form: gameboard
sense: 02860303-n
part of speech: noun

02860303-n
type: LexicalConcept
in scheme: en-word.net
definition: a flat portable surface (usually rectangular) designed for board games
example: he got out the board and set up the pieces
ili: i50877
lexfile: noun.artifact
part of speech: noun
hypernym: 04369112-n